BDBM49606 6-Bromo-2-(3,4-dichloro-phenyl)-imidazo[1,2-a]pyridine::6-bromanyl-2-(3,4-dichlorophenyl)imidazo[1,2-a]pyridine;hydrobromide::6-bromo-2-(3,4-dichlorophenyl)imidazo[1,2-a]pyridine;hydrobromide::MLS000589550::SMR000212963::cid_12005545
SMILES Clc1ccc(cc1Cl)-c1cn2cc(Br)ccc2n1
InChI Key InChIKey=WBCUXTKEIVNLNS-UHFFFAOYSA-N
Data  1 EC50
  Tab Delimited (TSV)   2D SDfile   Computed 3D by Vconf -m prep SDfile
Find this compound or compounds like it in BindingDB:
Activity Spreadsheet -- Enzyme Inhibition Constant Data from BindingDB
Found 1 hit for monomerid = 49606
TargetTranscription factor p65(Homo sapiens (Human))
Srmlsc
Curated by PubChem BioAssay
LigandPNGBDBM49606(6-Bromo-2-(3,4-dichloro-phenyl)-imidazo[1,2-a]pyri...)
Affinity DataEC50:  62nM. Assay description: Southern Research Molecular Libraries Screening Center (SRMLSC) Southern Research Institute (Birmingham, Alabama) NIH Molecular Libraries Screening C...
In DepthDetails PCBioAssay