BDBM496804 SARS-CoV-2 PLpro Inhibitor, 34
SMILES C[C@@H](NC(=O)c1cc(ccc1Cl)N(C)C1CNC1)c1cccc2ccccc12
InChI Key InChIKey=QYHGXCHPJLCRHJ-OAHLLOKOSA-N
Data  1 IC50  1 Kd
  Tab Delimited (TSV)   2D SDfile   Computed 3D by Vconf -m prep SDfile
Find this compound or compounds like it in BindingDB:
Activity Spreadsheet -- Enzyme Inhibition Constant Data from BindingDB
Found 1 hit for monomerid = 496804
TargetReplicase polyprotein 1ab(2019-nCoV)
University of Illinois At Chicago
LigandPNGBDBM496804(SARS-CoV-2 PLpro Inhibitor, 34)
Affinity DataKd:  4.19E+4nM. Assay description: The His-tagged SARS-CoV-2 PLpro enzyme was initially prepared in phosphate buffer and diluted to 50 ug/mL with 10 mM sodium acetate (pH 5.5) and immo...
Ligand InfoPC cidPC sid
In DepthDetails ArticlePubMed