BDBM497205 US11001563, Compound WX100
SMILES NC\C(COc1ccc(-c2nc(n[nH]2)N2CCOCC2)c(F)c1)=C\F
InChI Key InChIKey=OCWCFWIISDLZJE-FLIBITNWSA-N
Data  1 IC50
  Tab Delimited (TSV)   2D SDfile   Computed 3D by Vconf -m prep SDfile
Find this compound or compounds like it in BindingDB:
Activity Spreadsheet -- Enzyme Inhibition Constant Data from BindingDB
Found 1 hit for monomerid = 497205
TargetMembrane primary amine oxidase(Homo sapiens (Human))
TBA
US Patent
LigandPNGBDBM497205(US11001563, Compound WX100)
Affinity DataIC50:  1.10nM. Assay description: The inhibition of the sample on VAP-enzyme activity was measured by using an Amplex® Red Monoamine Oxidase kit (Invitrogen #A12214). 100 nL of the gr...
Ligand InfoPC cidPC sid
In DepthDetails US Patent