BDBM497509 2-(6-{5-chloro-2-[(oxan- 4-yl)amino]pyrimidin-4- yl}-1-oxo-2,3-dihydro- 1H-isoindol-2-yl)-N- [(1S)-1-[6-(difluoromethyl) pyridin-2-yl]-2- hydroxyethyl]acetamide::US11001575, Example 336
SMILES COc1cccc(c1)[C@H](NC(=O)CN1Cc2ccc(cc2C1=O)-c1nc(NC2CCOCC2)ncc1Br)[C@H](C)O
InChI Key InChIKey=WHPLDOXQFGDZFD-MRDQGFSESA-N
Data  1 IC50
  Tab Delimited (TSV)   2D SDfile   Computed 3D by Vconf -m prep SDfile
Find this compound or compounds like it in BindingDB:
Activity Spreadsheet -- Enzyme Inhibition Constant Data from BindingDB
Found 1 hit for monomerid = 497509
TargetMitogen-activated protein kinase 1(Homo sapiens (Human))
Otsuka Pharmaceutical
US Patent
LigandPNGBDBM497509(2-(6-{5-chloro-2-[(oxan- 4-yl)amino]pyrimidin-4- y...)
Affinity DataIC50:  1.60nM. Assay description: Activity of ERK2 enzyme (Life Technologies) was determined using a time-resolved fluorescence format measuring the phosphorylation of a truncated ver...
Ligand InfoPC cidPC sid
In DepthDetails US Patent