BDBM499479 US11020381, WO2012/007868 Reference compound (B)
SMILES CS(=O)(=O)NC(=O)c1ccc(COc2cccc(c2)-c2cccnc2)c(F)c1
InChI Key InChIKey=FPVHMUMNOWDIAM-UHFFFAOYSA-N
Data  1 IC50
  Tab Delimited (TSV)   2D SDfile   Computed 3D by Vconf -m prep SDfile
Find this compound or compounds like it in BindingDB:
Activity Spreadsheet -- Enzyme Inhibition Constant Data from BindingDB
Found 1 hit for monomerid = 499479
TargetSodium channel protein type 9 subunit alpha(Homo sapiens (Human))
Raqualia Pharma
US Patent
LigandPNGBDBM499479(US11020381, WO2012/007868 Reference compound (B))
Affinity DataIC50:  1.30E+3nM
Ligand InfoPC cidPC sid
In DepthDetails US Patent