BDBM49973 MLS001033481::N-(4-butylphenyl)-2-pyrazinecarboxamide::N-(4-butylphenyl)pyrazinamide::N-(4-butylphenyl)pyrazine-2-carboxamide::SMR000385610::cid_2852872
SMILES CCCCc1ccc(NC(=O)c2cnccn2)cc1
InChI Key InChIKey=XOHRMLKRVJSVIE-UHFFFAOYSA-N
Data  2 EC50
  Tab Delimited (TSV)   2D SDfile   Computed 3D by Vconf -m prep SDfile
Find this compound or compounds like it in BindingDB:
Activity Spreadsheet -- Enzyme Inhibition Constant Data from BindingDB
Found 2 hits for monomerid = 49973
TargetTumor necrosis factor receptor superfamily member 10B(Homo sapiens (Human))
Burnham Center For Chemical Genomics
Curated by PubChem BioAssay
LigandPNGBDBM49973(MLS001033481 | N-(4-butylphenyl)-2-pyrazinecarboxa...)
Affinity DataEC50:  9.85E+3nM
In DepthDetails PCBioAssay
TargetTranscription factor p65(Homo sapiens (Human))
Srmlsc
Curated by PubChem BioAssay
LigandPNGBDBM49973(MLS001033481 | N-(4-butylphenyl)-2-pyrazinecarboxa...)
Affinity DataEC50:  250nM. Assay description: Southern Research Molecular Libraries Screening Center (SRMLSC) Southern Research Institute (Birmingham, Alabama) NIH Molecular Libraries Screening C...
In DepthDetails PCBioAssay