BDBM50000427 5-(2-Fluoro-benzoylamino)-pyridine-2-carboxylic acid; Hydrate::CHEMBL167725
SMILES OC(=O)c1ccc(NC(=O)c2ccccc2F)cn1
InChI Key InChIKey=XPDRDECZNJUFBI-UHFFFAOYSA-N
Data  1 IC50
  Tab Delimited (TSV)   2D SDfile   Computed 3D by Vconf -m prep SDfile
Find this compound or compounds like it in BindingDB:
Activity Spreadsheet -- Enzyme Inhibition Constant Data from BindingDB
Found 1 hit for monomerid = 50000427
TargetTransmembrane prolyl 4-hydroxylase(Homo sapiens (Human))
Ici Pharmaceuticals Group
Curated by ChEMBL
LigandPNGBDBM50000427(5-(2-Fluoro-benzoylamino)-pyridine-2-carboxylic ac...)
Affinity DataIC50:  3.38E+4nM. Assay description: Inhibition of prolyl 4-hydroxylase activity by an indirect assay
In DepthDetails ArticlePubMed