BDBM50000475 CHEMBL555068
SMILES Cl.Cc1cccc2C(=O)N(CCc12)[C@@H]1CN2CCC1CC2
InChI Key InChIKey=OYNNAFIXQNCMOT-PKLMIRHRSA-N
Data  1 KI
  Tab Delimited (TSV)   2D SDfile   Computed 3D by Vconf -m prep SDfile
Find this compound or compounds like it in BindingDB:
Activity Spreadsheet -- Enzyme Inhibition Constant Data from BindingDB
Found 1 hit for monomerid = 50000475
Target5-hydroxytryptamine receptor 3A/3B(Rattus norvegicus)
Syntex Research
Curated by ChEMBL
LigandPNGBDBM50000475(CHEMBL555068)
Affinity DataKi:  0.320nM. Assay description: Binding affinity against 5-hydroxytryptamine 3 (5-HT3) receptor in rat brain cortical membranes using radioligand [3H]quipazineChecked by Author
In DepthDetails ArticlePubMed