BDBM50000484 7-Chloro-2,2-dimethyl-2,3,4,5-tetrahydro-benzo[b]oxepine-9-carboxylic acid (1-aza-bicyclo[2.2.2]oct-3-yl)-amide::CHEMBL169443
SMILES CC1(C)CCCc2cc(Cl)cc(C(=O)NC3CN4CCC3CC4)c2O1
InChI Key InChIKey=JADVZCOADCMTQF-UHFFFAOYSA-N
Data  1 KI
  Tab Delimited (TSV)   2D SDfile   Computed 3D by Vconf -m prep SDfile
Find this compound or compounds like it in BindingDB:
Activity Spreadsheet -- Enzyme Inhibition Constant Data from BindingDB
Found 1 hit for monomerid = 50000484
Target5-hydroxytryptamine receptor 3A/3B(Rattus norvegicus)
Rh£Ne-Poulenc Rorer Central Research
Curated by ChEMBL
LigandPNGBDBM50000484(7-Chloro-2,2-dimethyl-2,3,4,5-tetrahydro-benzo[b]o...)
Affinity DataKi:  16nM. Assay description: Displacement of the 5-hydroxytryptamine 3 receptor ligand [3H]GR-65630 from rat brain cortical membranes.
In DepthDetails ArticlePubMed