BDBM50001005 CHEMBL3235682
SMILES NS(=O)(=O)Oc1ccc(Sc2ccc(OS(N)(=O)=O)cc2)cc1
InChI Key InChIKey=HRUVZHPJVFCBHT-UHFFFAOYSA-N
Data  1 IC50
  Tab Delimited (TSV)   2D SDfile   Computed 3D by Vconf -m prep SDfile
Find this compound or compounds like it in BindingDB:
Activity Spreadsheet -- Enzyme Inhibition Constant Data from BindingDB
Found 1 hit for monomerid = 50001005
TargetSteryl-sulfatase(Homo sapiens (Human))
The University Of Tokyo
Curated by ChEMBL
LigandPNGBDBM50001005(CHEMBL3235682)
Affinity DataIC50:  88nM. Assay description: Inhibition of steroid sulfatase in human MCF7 cells assessed as conversion of [3H]E1S to [3H]E1 and [3H]E2 after 5 hrs by liquid scintillation counti...
In DepthDetails ArticlePubMed