BDBM50001470 3-Isobutoxy-9H-beta-carboline::CHEMBL87334
SMILES CC(C)COc1cc2c(c[nH]1)nc1ccccc21
InChI Key InChIKey=QUDSZGFPDUXASR-UHFFFAOYSA-N
Data  15 KI
  Tab Delimited (TSV)   2D SDfile   Computed 3D by Vconf -m prep SDfile
Find this compound or compounds like it in BindingDB:
Activity Spreadsheet -- Enzyme Inhibition Constant Data from BindingDB
Found 15 hits for monomerid = 50001470
TargetGamma-aminobutyric acid receptor subunit alpha-1/beta-3/gamma-2(Homo sapiens (Human))
University Of Wisconsin-Milwaukee
Curated by ChEMBL
LigandPNGBDBM50001470(3-Isobutoxy-9H-beta-carboline | CHEMBL87334)
Affinity DataKi:  24.9nM. Assay description: Binding affinity for human recombinant gamma-aminobutyric-acid (GABA) A receptor alpha-1-beta-3-gamma-2
In DepthDetails ArticlePubMed
TargetGamma-aminobutyric acid receptor subunit alpha-1/beta-3/gamma-2(Homo sapiens (Human))
University Of Wisconsin-Milwaukee
Curated by ChEMBL
LigandPNGBDBM50001470(3-Isobutoxy-9H-beta-carboline | CHEMBL87334)
Affinity DataKi:  24.9nM. Assay description: Displacement of [3H]flunitrazepam from human recombinant GABAA alpha1beta3gamma2 receptor expressed in HEK cells by liquid scintillation counting
In DepthDetails ArticlePubMed
TargetGamma-aminobutyric acid receptor subunit alpha-1/beta-3/gamma-2(Homo sapiens (Human))
University Of Wisconsin-Milwaukee
Curated by ChEMBL
LigandPNGBDBM50001470(3-Isobutoxy-9H-beta-carboline | CHEMBL87334)
Affinity DataKi:  25nM. Assay description: Binding affinity measured using LtK- cell membranes expressing GABA alpha1-beta3-gamma2 receptor
In DepthDetails ArticlePubMed
TargetGABA-A receptor; alpha-2/beta-3/gamma-2(Homo sapiens (Human))
University Of Wisconsin-Milwaukee
Curated by ChEMBL
LigandPNGBDBM50001470(3-Isobutoxy-9H-beta-carboline | CHEMBL87334)
Affinity DataKi:  124nM. Assay description: Displacement of [3H]flunitrazepam from human recombinant GABAA alpha2beta3gamma2 receptor expressed in HEK cells by liquid scintillation counting
In DepthDetails ArticlePubMed
TargetGABA-A receptor; alpha-2/beta-3/gamma-2(Homo sapiens (Human))
University Of Wisconsin-Milwaukee
Curated by ChEMBL
LigandPNGBDBM50001470(3-Isobutoxy-9H-beta-carboline | CHEMBL87334)
Affinity DataKi:  124nM. Assay description: Binding affinity measured using LtK- cell membranes expressing GABA alpha2-beta3-gamma2 receptor
In DepthDetails ArticlePubMed
TargetGABA-A receptor; alpha-2/beta-3/gamma-2(Homo sapiens (Human))
University Of Wisconsin-Milwaukee
Curated by ChEMBL
LigandPNGBDBM50001470(3-Isobutoxy-9H-beta-carboline | CHEMBL87334)
Affinity DataKi:  124nM. Assay description: Binding affinity to human recombinant gamma-aminobutyric-acid (GABA) A receptor alpha-2-beta-3-gamma-2
In DepthDetails ArticlePubMed
TargetGamma-aminobutyric acid receptor subunit alpha-3/beta-3/gamma-2(Homo sapiens (Human))
University Of Wisconsin-Milwaukee
Curated by ChEMBL
LigandPNGBDBM50001470(3-Isobutoxy-9H-beta-carboline | CHEMBL87334)
Affinity DataKi:  139nM. Assay description: Binding affinity measured using LtK- cell membranes expressing GABA alpha3-beta3-gamma2 receptor
In DepthDetails ArticlePubMed
TargetGamma-aminobutyric acid receptor subunit alpha-3/beta-3/gamma-2(Homo sapiens (Human))
University Of Wisconsin-Milwaukee
Curated by ChEMBL
LigandPNGBDBM50001470(3-Isobutoxy-9H-beta-carboline | CHEMBL87334)
Affinity DataKi:  139nM. Assay description: Binding affinity for human recombinant gamma-aminobutyric-acid (GABA) A receptor alpha-3-beta-3-gamma-2
In DepthDetails ArticlePubMed
TargetGamma-aminobutyric acid receptor subunit alpha-3/beta-3/gamma-2(Homo sapiens (Human))
University Of Wisconsin-Milwaukee
Curated by ChEMBL
LigandPNGBDBM50001470(3-Isobutoxy-9H-beta-carboline | CHEMBL87334)
Affinity DataKi:  139nM. Assay description: Displacement of [3H]flunitrazepam from human recombinant GABAA alpha3beta3gamma2 receptor expressed in HEK cells by liquid scintillation counting
In DepthDetails ArticlePubMed
TargetGABA-A receptor; alpha-5/beta-3/gamma-2(Homo sapiens (Human))
University Of Wisconsin-Milwaukee
Curated by ChEMBL
LigandPNGBDBM50001470(3-Isobutoxy-9H-beta-carboline | CHEMBL87334)
Affinity DataKi:  1.00E+3nM. Assay description: Displacement of [3H]flunitrazepam from human recombinant GABAA alpha5beta3gamma2 receptor expressed in HEK cells by liquid scintillation counting
In DepthDetails ArticlePubMed
TargetGABA-A receptor; alpha-5/beta-3/gamma-2(Homo sapiens (Human))
University Of Wisconsin-Milwaukee
Curated by ChEMBL
LigandPNGBDBM50001470(3-Isobutoxy-9H-beta-carboline | CHEMBL87334)
Affinity DataKi:  1.00E+3nM. Assay description: Binding affinity measured using LtK- cell membranes expressing Gamma-aminobutyric-acid A receptor alpha5-beta3-gamma2
In DepthDetails ArticlePubMed
TargetGABA-A receptor; alpha-5/beta-3/gamma-2(Homo sapiens (Human))
University Of Wisconsin-Milwaukee
Curated by ChEMBL
LigandPNGBDBM50001470(3-Isobutoxy-9H-beta-carboline | CHEMBL87334)
Affinity DataKi:  1.00E+3nM. Assay description: Binding affinity for human recombinant gamma-aminobutyric-acid (GABA) A receptor alpha-5-beta-3-gamma-2
In DepthDetails ArticlePubMed
TargetGamma-aminobutyric acid receptor subunit alpha-6/beta-3/gamma-2(Homo sapiens (Human))
University Of Wisconsin-Milwaukee
Curated by ChEMBL
LigandPNGBDBM50001470(3-Isobutoxy-9H-beta-carboline | CHEMBL87334)
Affinity DataKi:  1.00E+4nM. Assay description: Displacement of [3H]flunitrazepam from human recombinant GABAA alpha6beta3gamma2 receptor expressed in HEK cells by liquid scintillation counting
In DepthDetails ArticlePubMed
TargetGamma-aminobutyric acid receptor subunit alpha-6/beta-3/gamma-2(Homo sapiens (Human))
University Of Wisconsin-Milwaukee
Curated by ChEMBL
LigandPNGBDBM50001470(3-Isobutoxy-9H-beta-carboline | CHEMBL87334)
Affinity DataKi: >1.00E+4nM. Assay description: Binding affinity for human recombinant gamma-aminobutyric-acid (GABA) A receptor alpha-6-beta-3-gamma-2
In DepthDetails ArticlePubMed
TargetGamma-aminobutyric acid receptor subunit alpha-6/beta-3/gamma-2(Homo sapiens (Human))
University Of Wisconsin-Milwaukee
Curated by ChEMBL
LigandPNGBDBM50001470(3-Isobutoxy-9H-beta-carboline | CHEMBL87334)
Affinity DataKi: >1.00E+4nM. Assay description: Binding affinity measured using LtK- cell membranes expressing Gamma-aminobutyric-acid A receptor alpha6-beta3-gamma2
In DepthDetails ArticlePubMed