BDBM50001613 7-(4-Phenyl-quinolin-2-yloxy)-heptanoic acid::CHEMBL136433
SMILES OC(=O)CCCCCCOc1cc(-c2ccccc2)c2ccccc2n1
InChI Key InChIKey=PHNKMPPFWKNSEZ-UHFFFAOYSA-N
Data  1 IC50
  Tab Delimited (TSV)   2D SDfile   Computed 3D by Vconf -m prep SDfile
Find this compound or compounds like it in BindingDB:
Activity Spreadsheet -- Enzyme Inhibition Constant Data from BindingDB
Found 1 hit for monomerid = 50001613
TargetLeukotriene B4 receptor 1(Homo sapiens (Human))
Centre De Recherche De Vitry-Alfortville
Curated by ChEMBL
LigandPNGBDBM50001613(7-(4-Phenyl-quinolin-2-yloxy)-heptanoic acid | CHE...)
Affinity DataIC50:  1.80E+3nM. Assay description: Inhibition of [3H]-LTB4 binding to Leukotriene B4 receptor in the guinea pig spleen membranes
In DepthDetails ArticlePubMed