BDBM50001629 6-[4-(3-Methoxy-phenyl)-quinolin-2-yloxy]-2,2-dimethyl-hexanoic acid::CHEMBL434810
SMILES COc1cccc(c1)-c1cc(OCCCCC(C)(C)C(O)=O)nc2ccccc12
InChI Key InChIKey=MMNQOHFBTATYNR-UHFFFAOYSA-N
Data  1 IC50
  Tab Delimited (TSV)   2D SDfile   Computed 3D by Vconf -m prep SDfile
Find this compound or compounds like it in BindingDB:
Activity Spreadsheet -- Enzyme Inhibition Constant Data from BindingDB
Found 1 hit for monomerid = 50001629
TargetLeukotriene B4 receptor 1(Homo sapiens (Human))
Centre De Recherche De Vitry-Alfortville
Curated by ChEMBL
LigandPNGBDBM50001629(6-[4-(3-Methoxy-phenyl)-quinolin-2-yloxy]-2,2-dime...)
Affinity DataIC50:  300nM. Assay description: Inhibition of [3H]-LTB4 binding to Leukotriene B4 receptor in the guinea pig spleen membranes
In DepthDetails ArticlePubMed