BDBM50001630 2,2-Dimethyl-6-[4-(4-nitro-phenyl)-quinolin-2-yloxy]-hexanoic acid::CHEMBL134698
SMILES CC(C)(CCCCOc1cc(-c2ccc(cc2)[N+]([O-])=O)c2ccccc2n1)C(O)=O
InChI Key InChIKey=WLEGGOQVHTYVEK-UHFFFAOYSA-N
Data  1 IC50
  Tab Delimited (TSV)   2D SDfile   Computed 3D by Vconf -m prep SDfile
Find this compound or compounds like it in BindingDB:
Activity Spreadsheet -- Enzyme Inhibition Constant Data from BindingDB
Found 1 hit for monomerid = 50001630
TargetLeukotriene B4 receptor 1(Homo sapiens (Human))
Centre De Recherche De Vitry-Alfortville
Curated by ChEMBL
LigandPNGBDBM50001630(2,2-Dimethyl-6-[4-(4-nitro-phenyl)-quinolin-2-ylox...)
Affinity DataIC50:  150nM. Assay description: Inhibition of [3H]-LTB4 binding to Leukotriene B4 receptor in the guinea pig spleen membranes
In DepthDetails ArticlePubMed