BDBM50002869 CHEMBL230522
SMILES Cc1oc(nc1CCOc1ccc(C[C@@H](CNC(=O)C2CCC(CN)CC2)Nc2ccccc2C(=O)c2ccccc2)cc1)-c1ccccc1
InChI Key InChIKey=ACXJRGZNKVVUCQ-MIBGPUDPSA-N
Data  1 KI
  Tab Delimited (TSV)   2D SDfile   Computed 3D by Vconf -m prep SDfile
Find this compound or compounds like it in BindingDB:
Activity Spreadsheet -- Enzyme Inhibition Constant Data from BindingDB
Found 1 hit for monomerid = 50002869
TargetPeroxisome proliferator-activated receptor gamma(Homo sapiens (Human))
Glaxosmithkline
Curated by ChEMBL
LigandPNGBDBM50002869(CHEMBL230522)
Affinity DataKi:  195nM. Assay description: Displacement of [3H]BRL49653 from PPARgamma by scintillation proximity assayChecked by Author
In DepthDetails ArticlePubMed