BDBM50005346 CHEMBL3115301
SMILES Cn1c2nc(ccc2c(O)c(C(=O)NCC(O)=O)c1=O)-c1cccnc1
InChI Key InChIKey=WSKFHFKKXWLVSR-UHFFFAOYSA-N
Data  1 IC50
  Tab Delimited (TSV)   2D SDfile   Computed 3D by Vconf -m prep SDfile
Find this compound or compounds like it in BindingDB:
Activity Spreadsheet -- Enzyme Inhibition Constant Data from BindingDB
Found 1 hit for monomerid = 50005346
TargetEgl nine homolog 1(Homo sapiens (Human))
Janssen Research And Development
Curated by ChEMBL
LigandPNGBDBM50005346(CHEMBL3115301)
Affinity DataIC50: <50nM. Assay description: Inhibition of PHD2 (unknown origin) using P564 HIFlalpha as substrate after 1 hr by TR-FRET assay
In DepthDetails ArticlePubMed