BDBM50006526 (6-Fluoro-4-hydroxy-3-methyl-chroman-4-yl)-acetic acid::CHEMBL302014
SMILES C[C@@H]1COc2ccc(F)cc2[C@]1(O)CC(O)=O
InChI Key InChIKey=VMOKPYREBXNICA-KRTXAFLBSA-N
Data  1 IC50
  Tab Delimited (TSV)   2D SDfile   Computed 3D by Vconf -m prep SDfile
Find this compound or compounds like it in BindingDB:
Activity Spreadsheet -- Enzyme Inhibition Constant Data from BindingDB
Found 1 hit for monomerid = 50006526
TargetAldo-keto reductase family 1 member B1(Homo sapiens (Human))
Pfizer
Curated by ChEMBL
LigandPNGBDBM50006526((6-Fluoro-4-hydroxy-3-methyl-chroman-4-yl)-acetic ...)
Affinity DataIC50:  1.10E+4nM. Assay description: Inhibitory activity against human placental aldose reductase
In DepthDetails ArticlePubMed