BDBM50007229 7-Fluoro-1,3,9,9a-tetrahydro-imidazo[4,5-b]quinolin-2-one::CHEMBL97946
SMILES Fc1ccc2Nc3[nH]c(=O)[nH]c3Cc2c1
InChI Key InChIKey=KEKZXYFSRXXPCA-UHFFFAOYSA-N
Data  2 IC50
  Tab Delimited (TSV)   2D SDfile   Computed 3D by Vconf -m prep SDfile
Find this compound or compounds like it in BindingDB:
Activity Spreadsheet -- Enzyme Inhibition Constant Data from BindingDB
Found 2 hits for monomerid = 50007229
TargetcGMP-inhibited 3',5'-cyclic phosphodiesterase 3A/3B(Homo sapiens (Human))
Bristol-Myers Squibb Pharmaceutical Research Institute
Curated by ChEMBL
LigandPNGBDBM50007229(7-Fluoro-1,3,9,9a-tetrahydro-imidazo[4,5-b]quinoli...)
Affinity DataIC50:  30nM. Assay description: Inhibition of hydrolysis of c-AMP phosphodiesterase in human platelets
In DepthDetails ArticlePubMed
TargetcGMP-dependent 3',5'-cyclic phosphodiesterase(Homo sapiens (Human))
Bristol-Myers Squibb Pharmaceutical Research Institute
Curated by ChEMBL
LigandPNGBDBM50007229(7-Fluoro-1,3,9,9a-tetrahydro-imidazo[4,5-b]quinoli...)
Affinity DataIC50:  4.00E+4nM. Assay description: Inhibition of cGMP hydrolysis by human platelet phosphodiesterase
In DepthDetails ArticlePubMed