BDBM50007909 CHEMBL3234343
SMILES CC[N+](C)(CC)CCCC([O-])=O
InChI Key InChIKey=JVRBBPXITQNGAX-UHFFFAOYSA-N
Data  1 IC50
  Tab Delimited (TSV)   2D SDfile   Computed 3D by Vconf -m prep SDfile
Find this compound or compounds like it in BindingDB:
Activity Spreadsheet -- Enzyme Inhibition Constant Data from BindingDB
Found 1 hit for monomerid = 50007909
TargetGamma-butyrobetaine dioxygenase(Homo sapiens (Human))
Latvian Biomedical Research And Study Centre
Curated by ChEMBL
LigandPNGBDBM50007909(CHEMBL3234343)
Affinity DataIC50:  1.00E+5nM. Assay description: Inhibition of human recombinant BBOX expressed in Saccharomyces cerevisiae AH22 assessed as formation of carnitine from gamma-butyrobetaine preincuba...
In DepthDetails ArticlePubMed