BDBM50007973 CHEBI:17237::CHEMBL3234369
SMILES C[N+](C)(C)C\C=C\C([O-])=O
InChI Key InChIKey=GUYHPGUANSLONG-SNAWJCMRSA-N
Data  1 IC50
  Tab Delimited (TSV)   2D SDfile   Computed 3D by Vconf -m prep SDfile
Find this compound or compounds like it in BindingDB:
Activity Spreadsheet -- Enzyme Inhibition Constant Data from BindingDB
Found 1 hit for monomerid = 50007973
TargetGamma-butyrobetaine dioxygenase(Homo sapiens (Human))
Latvian Biomedical Research And Study Centre
Curated by ChEMBL
LigandPNGBDBM50007973(CHEBI:17237 | CHEMBL3234369)
Affinity DataIC50:  3.80E+3nM. Assay description: Inhibition of human recombinant BBOX expressed in Saccharomyces cerevisiae AH22 assessed as formation of carnitine from gamma-butyrobetaine preincuba...
In DepthDetails ArticlePubMed