BDBM50007984 3-{2-[2-tert-Butoxycarbonylamino-3-(1H-indol-3-yl)-propionylamino]-6-[3-(3-trifluoromethyl-phenyl)-ureido]-hexanoylamino}-N-(1-carbamoyl-2-phenyl-ethyl)-succinamic acid::CHEMBL3142696
SMILES CC(C)(C)OC(=O)N[C@@H](Cc1c[nH]c2ccccc12)C(=O)N[C@@H](CCCCNC(=O)Nc1cccc(c1)C(F)(F)F)C(=O)N[C@@H](CC(O)=O)C(=O)N[C@@H](Cc1ccccc1)C(N)=O
InChI Key InChIKey=UUOABMMWVXIMCN-XILBPPKJSA-N
Data  2 IC50
  Tab Delimited (TSV)   2D SDfile   Computed 3D by Vconf -m prep SDfile
Find this compound or compounds like it in BindingDB:
Activity Spreadsheet -- Enzyme Inhibition Constant Data from BindingDB
Found 2 hits for monomerid = 50007984
TargetGastrin/cholecystokinin type B receptor(Homo sapiens (Human))
Abbott Laboratories
Curated by ChEMBL
LigandPNGBDBM50007984(3-{2-[2-tert-Butoxycarbonylamino-3-(1H-indol-3-yl)...)
Affinity DataIC50:  3.00E+3nM. Assay description: Binding affinity for Cholecystokinin type B receptor in guinea pig cortex by using [125I]-BH-CCK-8 as radioligand
In DepthDetails ArticlePubMed
TargetCholecystokinin receptor type A(Cavia porcellus)
Abbott Laboratories
Curated by ChEMBL
LigandPNGBDBM50007984(3-{2-[2-tert-Butoxycarbonylamino-3-(1H-indol-3-yl)...)
Affinity DataIC50:  59nM. Assay description: Binding affinity for Cholecystokinin type A receptor in guinea pig pancreas by using [125I]-BH-CCK-8 as radioligand
In DepthDetails ArticlePubMed