BDBM50008087 CHEMBL3234430
SMILES OP(O)(=O)CCCS
InChI Key InChIKey=UOLMNMNHGFGIDE-UHFFFAOYSA-N
Data  1 IC50
  Tab Delimited (TSV)   2D SDfile   Computed 3D by Vconf -m prep SDfile
Find this compound or compounds like it in BindingDB:
Activity Spreadsheet -- Enzyme Inhibition Constant Data from BindingDB
Found 1 hit for monomerid = 50008087
TargetFe(3+)-Zn(2+) purple acid phosphatase(Phaseolus vulgaris)
The University Of Queensland
Curated by ChEMBL
LigandPNGBDBM50008087(CHEMBL3234430)
Affinity DataIC50:  1.60E+5nM. Assay description: Inhibition of red kidney beans purple acid phosphatase
In DepthDetails ArticlePubMed