BDBM50008094 CHEMBL3234724
SMILES OS(O)([O-])CC[NH+]1CCOCC1
InChI Key InChIKey=BNCLILUMVSPPMI-UHFFFAOYSA-N
Data  1 KI
  Tab Delimited (TSV)   2D SDfile   Computed 3D by Vconf -m prep SDfile
Find this compound or compounds like it in BindingDB:
Activity Spreadsheet -- Enzyme Inhibition Constant Data from BindingDB
Found 1 hit for monomerid = 50008094
TargetMetallo-beta-lactamase type 2(Bacteroides fragilis)
The University Of Queensland
Curated by ChEMBL
LigandPNGBDBM50008094(CHEMBL3234724)
Affinity DataKi:  2.30E+7nM. Assay description: Competitive inhibition of Bacteroides fragilis metallo-beta-lactamase CcrA
In DepthDetails ArticlePubMed