BDBM50009549 2-[6-Amino-2-(indan-2-ylamino)-purin-9-yl]-5-hydroxymethyl-tetrahydro-furan-3,4-diol::CHEMBL2374413
SMILES Nc1nc(NC2Cc3ccccc3C2)nc2n(cnc12)[C@@H]1O[C@H](CO)[C@@H](O)[C@H]1O
InChI Key InChIKey=VRTUKBNLDWESNL-SCFUHWHPSA-N
Data  2 IC50
  Tab Delimited (TSV)   2D SDfile   Computed 3D by Vconf -m prep SDfile
Find this compound or compounds like it in BindingDB:
Activity Spreadsheet -- Enzyme Inhibition Constant Data from BindingDB
Found 2 hits for monomerid = 50009549
TargetAdenosine receptor A2a/A2b(Rattus norvegicus)
Ciba-Geigy
Curated by ChEMBL
LigandPNGBDBM50009549(2-[6-Amino-2-(indan-2-ylamino)-purin-9-yl]-5-hydro...)
Affinity DataIC50:  288nM. Assay description: Concentration required for 50% inhibition of [3H]NECA binding on rat brain adenosine A2 receptor
In DepthDetails ArticlePubMed
TargetAdenosine receptor A1(Rattus norvegicus (rat))
Ciba-Geigy
Curated by ChEMBL
LigandPNGBDBM50009549(2-[6-Amino-2-(indan-2-ylamino)-purin-9-yl]-5-hydro...)
Affinity DataIC50:  2.95E+3nM. Assay description: Concentration required for 50% inhibition of [3H]-CHA binding on rat brain adenosine A1 receptor
In DepthDetails ArticlePubMed