BDBM50010242 CHEMBL1160594
SMILES O[C@H]1C[C@@H](O[C@@H]1COP(O)(O)=O)n1cc(I)c(=O)[nH]c1=O
InChI Key InChIKey=WXFYBFRZROJDLL-RRKCRQDMSA-N
Data  2 KI
  Tab Delimited (TSV)   2D SDfile   Computed 3D by Vconf -m prep SDfile
Find this compound or compounds like it in BindingDB:
Activity Spreadsheet -- Enzyme Inhibition Constant Data from BindingDB
Found 2 hits for monomerid = 50010242
TargetThymidylate synthase(Lactobacillus casei)
TBA
Curated by ChEMBL
LigandPNGBDBM50010242(CHEMBL1160594)
Affinity DataKi:  1.60E+3nM. Assay description: Inhibition of amethopterin-resistant Lactobacillus casei thymidylate synthetase-catalyzed dTMP formation using dUMP as substrate by spectrophotometri...
In DepthDetails ArticlePubMed
TargetThymidylate synthase(Lactobacillus casei)
TBA
Curated by ChEMBL
LigandPNGBDBM50010242(CHEMBL1160594)
Affinity DataKi:  1.60E+3nM. Assay description: Competitive inhibition of thymidylate synthase purified from methotrexate-resistant Lactobacillus casei using 2'-deoxy[5-3H]uridine 5'-phosphate by r...
In DepthDetails ArticlePubMed