BDBM50010415 (1-{1-[2-(3-{1-[(4-Amino-2-methyl-pyrimidin-5-ylmethyl)-carbamoyl]-2-methyl-butylcarbamoyl}-1-cyclohexylmethyl-2-hydroxy-propylcarbamoyl)-ethylcarbamoyl]-2-phenyl-ethylcarbamoyl}-piperidin-4-yl)-carbamic acid tert-butyl ester::CHEMBL407882
SMILES CC[C@H](C)[C@H](NC(=O)C[C@H](O)[C@H](CC1CCCCC1)NC(=O)CCNC(=O)[C@H](Cc1ccccc1)NC(=O)N1CCC(CC1)NC(=O)OC(C)(C)C)C(=O)NCc1cnc(C)nc1N
InChI Key InChIKey=SRTQIVBOFPIILO-XWLYGYOUSA-N
Data  3 IC50
  Tab Delimited (TSV)   2D SDfile   Computed 3D by Vconf -m prep SDfile
Find this compound or compounds like it in BindingDB:
Activity Spreadsheet -- Enzyme Inhibition Constant Data from BindingDB
Found 1 hit for monomerid = 50010415
TargetRenin(Homo sapiens (Human))
E. Merck Darmstadt
Curated by ChEMBL
LigandPNGBDBM50010415((1-{1-[2-(3-{1-[(4-Amino-2-methyl-pyrimidin-5-ylme...)
Affinity DataIC50:  0.650nM. Assay description: In vitro for inhibitory activity against human renin
In DepthDetails ArticlePubMed