BDBM50011760 1-(4-Amino-phenyl)-3-aza-bicyclo[3.1.0]hexane-2,4-dione::CHEMBL287574::US10849982, Compd # 4
SMILES Nc1ccc(cc1)C12CC1C(=O)NC2=O
InChI Key InChIKey=SGGCPUGLXWOPAP-UHFFFAOYSA-N
Data  1 KI  1 IC50  1 Kd
  Tab Delimited (TSV)   2D SDfile   Computed 3D by Vconf -m prep SDfile
Find this compound or compounds like it in BindingDB:
Activity Spreadsheet -- Enzyme Inhibition Constant Data from BindingDB
Found 3 hits for monomerid = 50011760
TargetAromatase(Homo sapiens (Human))
Institute Of Cancer Research
Curated by ChEMBL
LigandPNGBDBM50011760(1-(4-Amino-phenyl)-3-aza-bicyclo[3.1.0]hexane-2,4-...)
Affinity DataKi:  1.20E+3nM. Assay description: Inhibition of human placental cytochrome P450 19A1 androstenedione
In DepthDetails ArticlePubMed
TargetDNA damage-binding protein 1/Protein cereblon(Homo sapiens (Human))
C4 Therapeutics
US Patent
LigandPNGBDBM50011760(1-(4-Amino-phenyl)-3-aza-bicyclo[3.1.0]hexane-2,4-...)
Affinity DataKd: >3.00E+4nM. Assay description: Measuring compound ligand binding to CRBN-DDB1 was carried out using an established sensitive and quantitative in vitro fluorescence polarization (FP...
In DepthDetails US Patent
TargetAromatase(Homo sapiens (Human))
Institute Of Cancer Research
Curated by ChEMBL
LigandPNGBDBM50011760(1-(4-Amino-phenyl)-3-aza-bicyclo[3.1.0]hexane-2,4-...)
Affinity DataIC50:  1.80E+3nM. Assay description: In vitro inhibition of human placental Cytochrome P450 19A1 aromatase
In DepthDetails ArticlePubMed