BDBM50012141 CHEMBL3263709
SMILES CC(C)CN(Cc1cccc(c1)-c1ccc(cc1)S(C)(=O)=O)S(=O)(=O)Cc1ccccc1
InChI Key InChIKey=QUOSAZADSIMULB-UHFFFAOYSA-N
Data  1 IC50  1 EC50
  Tab Delimited (TSV)   2D SDfile   Computed 3D by Vconf -m prep SDfile
Find this compound or compounds like it in BindingDB:
Activity Spreadsheet -- Enzyme Inhibition Constant Data from BindingDB
Found 2 hits for monomerid = 50012141
TargetNuclear receptor ROR-gamma(Homo sapiens (Human))
Genentech
Curated by ChEMBL
LigandPNGBDBM50012141(CHEMBL3263709)
Affinity DataIC50: >1.00E+4nM. Assay description: Displacement of [3H2]25-hydroxycholesterol from human RORc-LBD after 3 hrs by scintillation counting
In DepthDetails ArticlePubMed
TargetNuclear receptor ROR-gamma(Homo sapiens (Human))
Genentech
Curated by ChEMBL
LigandPNGBDBM50012141(CHEMBL3263709)
Affinity DataEC50: >1.00E+4nM. Assay description: Inverse agonist activity at an N-terminal 6xHis-GST-tag human RORc-LBD assessed as inhibition of recruitment of the SRC1 co-activator peptide after 3...
In DepthDetails ArticlePubMed