BDBM50013209 4-Chloro-N-[5-(2-fluoro-phenyl)-1-methyl-2,3-dihydro-1H-benzo[e][1,4]diazepin-2-ylmethyl]-benzamide::CHEMBL140365
SMILES CN1C(CNC(=O)c2ccc(Cl)cc2)CN=C(c2ccccc2F)c2ccccc12
InChI Key InChIKey=CWUCSSZIAOIVHR-UHFFFAOYSA-N
Data  3 IC50
  Tab Delimited (TSV)   2D SDfile   Computed 3D by Vconf -m prep SDfile
Find this compound or compounds like it in BindingDB:
Activity Spreadsheet -- Enzyme Inhibition Constant Data from BindingDB
Found 3 hits for monomerid = 50013209
LigandPNGBDBM50013209(4-Chloro-N-[5-(2-fluoro-phenyl)-1-methyl-2,3-dihyd...)
Affinity DataIC50:  0.5nM. Assay description: Inhibition of binding of [125I]-CCK-8 to Cholecystokinin type A receptor in rat pancreas
In DepthDetails ArticlePubMed
TargetGastrin/cholecystokinin type B receptor(Homo sapiens (Human))
Merck Sharp & Dohme Research Laboratories
Curated by ChEMBL
LigandPNGBDBM50013209(4-Chloro-N-[5-(2-fluoro-phenyl)-1-methyl-2,3-dihyd...)
Affinity DataIC50:  3.74E+4nM. Assay description: Inhibition of binding of [125I]-CCK-8 to Cholecystokinin type B receptor in guinea pig brain tissues
In DepthDetails ArticlePubMed
TargetCholecystokinin receptor type A(RAT)
Merck Sharp & Dohme Research Laboratories
Curated by ChEMBL
LigandPNGBDBM50013209(4-Chloro-N-[5-(2-fluoro-phenyl)-1-methyl-2,3-dihyd...)
Affinity DataIC50:  800nM. Assay description: Inhibition of binding of [125I]-CCK-8 to Cholecystokinin type A receptor in rat pancreas
In DepthDetails ArticlePubMed