BDBM50013765 CHEMBL3264976
SMILES Cl.NS(=O)(=O)c1ccc(CNCc2ccc(O)cc2)cc1
InChI Key InChIKey=RQCSATAODOVSEI-UHFFFAOYSA-N
Data  2 KI
  Tab Delimited (TSV)   2D SDfile   Computed 3D by Vconf -m prep SDfile
Find this compound or compounds like it in BindingDB:
Activity Spreadsheet -- Enzyme Inhibition Constant Data from BindingDB
Found 2 hits for monomerid = 50013765
TargetCarbonic anhydrase 1(Homo sapiens (Human))
Enscm/Umii/Umr-Cnrs 5635
Curated by ChEMBL
LigandPNGBDBM50013765(CHEMBL3264976)
Affinity DataKi:  60nM. Assay description: Inhibition of human carbonic anhydrase 1-catalyzed CO2 hydration preincubated for 10 mins by stopped-flow assay
In DepthDetails ArticlePubMed
TargetCarbonic anhydrase 2(Homo sapiens (Human))
Enscm/Umii/Umr-Cnrs 5635
Curated by ChEMBL
LigandPNGBDBM50013765(CHEMBL3264976)
Affinity DataKi:  80nM. Assay description: Inhibition of human carbonic anhydrase 2-catalyzed CO2 hydration preincubated for 10 mins by stopped-flow assay
In DepthDetails ArticlePubMed