BDBM50013772 CHEMBL3264981
SMILES CC(C)(C)c1ccc(\C=N\CCc2ccc(cc2)S(N)(=O)=O)cc1
InChI Key InChIKey=DMWIEQWZHDUQHE-KGENOOAVSA-N
Data  2 KI
  Tab Delimited (TSV)   2D SDfile   Computed 3D by Vconf -m prep SDfile
Find this compound or compounds like it in BindingDB:
Activity Spreadsheet -- Enzyme Inhibition Constant Data from BindingDB
Found 2 hits for monomerid = 50013772
TargetCarbonic anhydrase 2(Homo sapiens (Human))
Enscm/Umii/Umr-Cnrs 5635
Curated by ChEMBL
LigandPNGBDBM50013772(CHEMBL3264981)
Affinity DataKi:  11nM. Assay description: Inhibition of human carbonic anhydrase 2-catalyzed CO2 hydration preincubated for 10 mins by stopped-flow assay
In DepthDetails ArticlePubMed
TargetCarbonic anhydrase 1(Homo sapiens (Human))
Enscm/Umii/Umr-Cnrs 5635
Curated by ChEMBL
LigandPNGBDBM50013772(CHEMBL3264981)
Affinity DataKi:  665nM. Assay description: Inhibition of human carbonic anhydrase 1-catalyzed CO2 hydration preincubated for 10 mins by stopped-flow assay
In DepthDetails ArticlePubMed