BDBM50014762 Bis-(4-chloro-phenyl)-piperidin-3-yl-methanol::CHEMBL335541
SMILES OC(C1CCCNC1)(c1ccc(Cl)cc1)c1ccc(Cl)cc1
InChI Key InChIKey=MTEWZIXFNAXFEB-UHFFFAOYSA-N
Data  1 EC50
  Tab Delimited (TSV)   2D SDfile   Computed 3D by Vconf -m prep SDfile
Find this compound or compounds like it in BindingDB:
Activity Spreadsheet -- Enzyme Inhibition Constant Data from BindingDB
Found 1 hit for monomerid = 50014762
TargetAromatase(Rattus norvegicus)
Eli Lilly
Curated by ChEMBL
LigandPNGBDBM50014762(Bis-(4-chloro-phenyl)-piperidin-3-yl-methanol | CH...)
Affinity DataEC50: >5.00E+3nM. Assay description: In vitro Cytochrome P450 19A1 inhibition concentration to decrease aromatization of androstenedione in rat ovarian microsome
In DepthDetails ArticlePubMed