BDBM50014763 4-[Bis-(4-chloro-phenyl)-imidazol-1-yl-methyl]-1H-pyrazole::CHEMBL137001
SMILES Clc1ccc(cc1)C(c1cn[nH]c1)(c1ccc(Cl)cc1)n1ccnc1
InChI Key InChIKey=FKCARZHIWKBDJK-UHFFFAOYSA-N
Data  1 EC50
  Tab Delimited (TSV)   2D SDfile   Computed 3D by Vconf -m prep SDfile
Find this compound or compounds like it in BindingDB:
Activity Spreadsheet -- Enzyme Inhibition Constant Data from BindingDB
Found 1 hit for monomerid = 50014763
TargetAromatase(Rattus norvegicus)
Eli Lilly
Curated by ChEMBL
LigandPNGBDBM50014763(4-[Bis-(4-chloro-phenyl)-imidazol-1-yl-methyl]-1H-...)
Affinity DataEC50:  11nM. Assay description: In vitro Cytochrome P450 19A1 inhibition concentration to decrease aromatization of androstenedione in rat ovarian microsome
In DepthDetails ArticlePubMed