BDBM50015970 3-Ethyl-1-pentyl-4,5-dihydro-3H-[3,4']bipyridinyl-2,6-dione::CHEMBL312960
SMILES CCCCCN1C(=O)CC[C@@](CC)(C1=O)c1ccncc1
InChI Key InChIKey=FCSXXRSPBWTXQA-QGZVFWFLSA-N
Data  1 IC50
  Tab Delimited (TSV)   2D SDfile   Computed 3D by Vconf -m prep SDfile
Find this compound or compounds like it in BindingDB:
Activity Spreadsheet -- Enzyme Inhibition Constant Data from BindingDB
Found 1 hit for monomerid = 50015970
TargetAromatase(Homo sapiens (Human))
Institute Of Cancer Research
Curated by ChEMBL
LigandPNGBDBM50015970(3-Ethyl-1-pentyl-4,5-dihydro-3H-[3,4']bipyridinyl-...)
Affinity DataIC50:  2.10E+4nM. Assay description: Inhibition of Cytochrome P450 19A1 in human placenta
In DepthDetails ArticlePubMed