BDBM50015973 3-Nonyl-4,5-dihydro-3H-[3,4']bipyridinyl-2,6-dione::CHEMBL91363
SMILES CCCCCCCCC[C@@]1(CCC(=O)NC1=O)c1ccncc1
InChI Key InChIKey=SUYHSALFGXTCQO-LJQANCHMSA-N
Data  1 IC50
  Tab Delimited (TSV)   2D SDfile   Computed 3D by Vconf -m prep SDfile
Find this compound or compounds like it in BindingDB:
Activity Spreadsheet -- Enzyme Inhibition Constant Data from BindingDB
Found 1 hit for monomerid = 50015973
TargetAromatase(Homo sapiens (Human))
Institute Of Cancer Research
Curated by ChEMBL
LigandPNGBDBM50015973(3-Nonyl-4,5-dihydro-3H-[3,4']bipyridinyl-2,6-dione...)
Affinity DataIC50:  2.40E+3nM. Assay description: Inhibition of Cytochrome P450 19A1 in human placenta
In DepthDetails ArticlePubMed