BDBM50015977 3-Ethyl-1-octyl-4,5-dihydro-3H-[3,4']bipyridinyl-2,6-dione::CHEMBL88918
SMILES CCCCCCCCN1C(=O)CC[C@@](CC)(C1=O)c1ccncc1
InChI Key InChIKey=OORIPAIYDLQOTG-HXUWFJFHSA-N
Data  1 IC50
  Tab Delimited (TSV)   2D SDfile   Computed 3D by Vconf -m prep SDfile
Find this compound or compounds like it in BindingDB:
Activity Spreadsheet -- Enzyme Inhibition Constant Data from BindingDB
Found 1 hit for monomerid = 50015977
TargetAromatase(Homo sapiens (Human))
Institute Of Cancer Research
Curated by ChEMBL
LigandPNGBDBM50015977(3-Ethyl-1-octyl-4,5-dihydro-3H-[3,4']bipyridinyl-2...)
Affinity DataIC50:  800nM. Assay description: Inhibition of Cytochrome P450 19A1 in human placenta
In DepthDetails ArticlePubMed