BDBM50015981 3-Pentyl-4,5-dihydro-3H-[3,4']bipyridinyl-2,6-dione::CHEMBL89102
SMILES CCCCC[C@@]1(CCC(=O)NC1=O)c1ccncc1
InChI Key InChIKey=CZNRVRXRMZJCIX-OAHLLOKOSA-N
Data  1 IC50
  Tab Delimited (TSV)   2D SDfile   Computed 3D by Vconf -m prep SDfile
Find this compound or compounds like it in BindingDB:
Activity Spreadsheet -- Enzyme Inhibition Constant Data from BindingDB
Found 1 hit for monomerid = 50015981
TargetAromatase(Homo sapiens (Human))
Institute Of Cancer Research
Curated by ChEMBL
LigandPNGBDBM50015981(3-Pentyl-4,5-dihydro-3H-[3,4']bipyridinyl-2,6-dion...)
Affinity DataIC50:  2.50E+3nM. Assay description: Inhibition of Cytochrome P450 19A1 in human placenta
In DepthDetails ArticlePubMed