BDBM50015982 3-Hexyl-4,5-dihydro-3H-[3,4']bipyridinyl-2,6-dione::CHEMBL441404
SMILES CCCCCC[C@@]1(CCC(=O)NC1=O)c1ccncc1
InChI Key InChIKey=OMXBJJLSIPHZKY-MRXNPFEDSA-N
Data  1 IC50
  Tab Delimited (TSV)   2D SDfile   Computed 3D by Vconf -m prep SDfile
Find this compound or compounds like it in BindingDB:
Activity Spreadsheet -- Enzyme Inhibition Constant Data from BindingDB
Found 1 hit for monomerid = 50015982
TargetAromatase(Homo sapiens (Human))
Institute Of Cancer Research
Curated by ChEMBL
LigandPNGBDBM50015982(3-Hexyl-4,5-dihydro-3H-[3,4']bipyridinyl-2,6-dione...)
Affinity DataIC50:  3.60E+3nM. Assay description: Inhibition of Cytochrome P450 19A1 in human placenta
In DepthDetails ArticlePubMed