BDBM50016340 2-[4-(4-{4-[4-(4-{4-[(2,4-Diamino-pteridin-6-ylmethyl)-methyl-amino]-benzoylamino}-butyrylamino)-butyrylamino]-butyrylamino}-butyrylamino)-butyrylamino]-pentanedioic acid::CHEMBL435778
SMILES CN(Cc1cnc2nc(N)nc(N)c2n1)c1ccc(cc1)C(=O)NCCCC(=O)NCCCC(=O)NCCCC(=O)NCCCC(=O)NCCCC(=O)NC(CCC(O)=O)C(O)=O
InChI Key InChIKey=TYJPEWVRMTYMGN-UHFFFAOYSA-N
Data  1 KI  1 IC50
  Tab Delimited (TSV)   2D SDfile   Computed 3D by Vconf -m prep SDfile
Find this compound or compounds like it in BindingDB:
Activity Spreadsheet -- Enzyme Inhibition Constant Data from BindingDB
Found 2 hits for monomerid = 50016340
TargetThymidylate synthase(Lactobacillus casei)
TBA
Curated by ChEMBL
LigandPNGBDBM50016340(2-[4-(4-{4-[4-(4-{4-[(2,4-Diamino-pteridin-6-ylmet...)
Affinity DataKi:  172nM. Assay description: Compound was tested for its ability to inhibit thymidylate synthetase isolated from MTX-resistant Lactobacillus casei
In DepthDetails ArticlePubMed
TargetDihydrofolate reductase(Mus musculus (Mouse))
TBA
Curated by ChEMBL
LigandPNGBDBM50016340(2-[4-(4-{4-[4-(4-{4-[(2,4-Diamino-pteridin-6-ylmet...)
Affinity DataIC50:  840nM. Assay description: Compound was tested for its ability to inhibit dihydrofolate reductase purified from murine L1210 cells
In DepthDetails ArticlePubMed