BDBM50017126 7-[6-Amino-2-(1-ethoxycarbonyl-3-phenyl-propylamino)-hexanoyl]-1,4-dithia-7-aza-spiro[4.4]nonane-8-carboxylic acid::CHEMBL415881
SMILES CCOC(=O)[C@H](CCc1ccccc1)N[C@@H](CCCCN)C(=O)N1CC2(C[C@H]1C(O)=O)SCCS2
InChI Key InChIKey=LUFPGGGCYURSDX-ACRUOGEOSA-N
Data  1 IC50
  Tab Delimited (TSV)   2D SDfile   Computed 3D by Vconf -m prep SDfile
Find this compound or compounds like it in BindingDB:
Activity Spreadsheet -- Enzyme Inhibition Constant Data from BindingDB
Found 1 hit for monomerid = 50017126
TargetAngiotensin-converting enzyme(Homo sapiens (Human))
Schering-Plough
Curated by ChEMBL
LigandPNGBDBM50017126(7-[6-Amino-2-(1-ethoxycarbonyl-3-phenyl-propylamin...)
Affinity DataIC50:  200nM. Assay description: Compound tested in vitro for inhibition of Angiotensin I converting enzyme
In DepthDetails ArticlePubMed