BDBM50017428 CHEMBL3288296
SMILES Brc1cccc(COc2ccc3C(=O)CCCc3c2)c1
InChI Key InChIKey=XEWIJBLUIQWBRA-UHFFFAOYSA-N
Data  2 IC50
  Tab Delimited (TSV)   2D SDfile   Computed 3D by Vconf -m prep SDfile
Find this compound or compounds like it in BindingDB:
Activity Spreadsheet -- Enzyme Inhibition Constant Data from BindingDB
Found 2 hits for monomerid = 50017428
TargetAmine oxidase [flavin-containing] B(Homo sapiens (Human))
North-West University
Curated by ChEMBL
LigandPNGBDBM50017428(CHEMBL3288296)
Affinity DataIC50:  9nM. Assay description: Inhibition of recombinant human MAO-B using kynuramine as substrate assessed as 4-hydroxyquinoline production after 30 mins by fluorescence spectroph...
In DepthDetails ArticlePubMed
TargetAmine oxidase [flavin-containing] A(Homo sapiens (Human))
North-West University
Curated by ChEMBL
LigandPNGBDBM50017428(CHEMBL3288296)
Affinity DataIC50:  212nM. Assay description: Inhibition of recombinant human MAO-A using kynuramine as substrate assessed as 4-hydroxyquinoline production after 30 mins by fluorescence spectroph...
In DepthDetails ArticlePubMed