BDBM50017707 CHEMBL3288965
SMILES [O-][N+](=O)c1ccc2[nH]c3cc(ccc3c2c1)C(F)(F)F
InChI Key InChIKey=JJRBDOATCXEQPD-UHFFFAOYSA-N
Data  1 IC50
  Tab Delimited (TSV)   2D SDfile   Computed 3D by Vconf -m prep SDfile
Find this compound or compounds like it in BindingDB:
Activity Spreadsheet -- Enzyme Inhibition Constant Data from BindingDB
Found 1 hit for monomerid = 50017707
TargetKinesin-like protein KIF11(Homo sapiens (Human))
Kyoto University
Curated by ChEMBL
LigandPNGBDBM50017707(CHEMBL3288965)
Affinity DataIC50:  43nM. Assay description: Inhibition of C-terminal His-tagged KSP ATPase motor domain (unknown origin) expressed in bacteria incubated for 30 mins prior to ATP addition measur...
In DepthDetails ArticlePubMed