BDBM50017776 CHEMBL28701::{1-[1-(4-Azido-1-cyclohexylmethyl-2-hydroxy-butylcarbamoyl)-2-(3H-imidazol-4-yl)-ethylcarbamoyl]-2-phenyl-ethyl}-carbamic acid tert-butyl ester
SMILES CC(C)(C)OC(=O)N[C@@H](Cc1ccccc1)C(=O)N[C@@H](Cc1cnc[nH]1)C(=O)N[C@H](CC1CCCCC1)[C@H](O)CCN=[N+]=[N-]
InChI Key InChIKey=XEBHOLAXAUQAMQ-LGTXBLIGSA-N
Data  1 IC50
  Tab Delimited (TSV)   2D SDfile   Computed 3D by Vconf -m prep SDfile
Find this compound or compounds like it in BindingDB:
Activity Spreadsheet -- Enzyme Inhibition Constant Data from BindingDB
Found 1 hit for monomerid = 50017776
TargetRenin(Homo sapiens (Human))
Abbott Laboratories
Curated by ChEMBL
LigandPNGBDBM50017776(CHEMBL28701 | {1-[1-(4-Azido-1-cyclohexylmethyl-2-...)
Affinity DataIC50:  20nMpH: 6.0Assay Description:Inhibitory activity against purified human renal renin at pH 6.0
In DepthDetails ArticlePubMed