BDBM50018167 8-Cyclohexyl-3-propyl-3,7-dihydro-purine-2,6-dione::CHEMBL21449
SMILES CCCn1c2nc([nH]c2c(=O)[nH]c1=O)C1CCCCC1
InChI Key InChIKey=ZDNILTNYWAZWBW-UHFFFAOYSA-N
Data  4 KI
  Tab Delimited (TSV)   2D SDfile   Computed 3D by Vconf -m prep SDfile
Find this compound or compounds like it in BindingDB:
Activity Spreadsheet -- Enzyme Inhibition Constant Data from BindingDB
Found 4 hits for monomerid = 50018167
TargetAdenosine receptor A1(Rattus norvegicus (rat))
National Institutes Of Health
Curated by ChEMBL
LigandPNGBDBM50018167(8-Cyclohexyl-3-propyl-3,7-dihydro-purine-2,6-dione...)
Affinity DataKi:  850nM. Assay description: Inhibition of 1 nM [3H]- N6-(phenylisopropyl) adenosine binding to Adenosine A1 receptor in rat cerebral cortical membranes
In DepthDetails ArticlePubMed
TargetAdenosine receptor A1(Rattus norvegicus (rat))
National Institutes Of Health
Curated by ChEMBL
LigandPNGBDBM50018167(8-Cyclohexyl-3-propyl-3,7-dihydro-purine-2,6-dione...)
Affinity DataKi:  850nM. Assay description: Binding affinity at Adenosine A1 receptor in rat brain cortical membrane using [3H]-N6-R-phenylisopropyladenosine (R-PIA) as radioligand
In DepthDetails ArticlePubMed
TargetAdenosine receptor A2a/A2b(Homo sapiens (Human))
National Institutes Of Health
Curated by ChEMBL
LigandPNGBDBM50018167(8-Cyclohexyl-3-propyl-3,7-dihydro-purine-2,6-dione...)
Affinity DataKi:  1.10E+3nM. Assay description: Inhibition of the stimulation by 5'-(N-ethylcarbamoyl) adenosine of adenyl cyclase via adenosine A2 receptor in human platelet membranes.
In DepthDetails ArticlePubMed
TargetAdenosine receptor A2a/A2b(Rattus norvegicus)
Pharmazeutische Chemie
Curated by ChEMBL
LigandPNGBDBM50018167(8-Cyclohexyl-3-propyl-3,7-dihydro-purine-2,6-dione...)
Affinity DataKi:  2.40E+4nM. Assay description: Binding affinity against Adenosine A2 receptor in rat striatal membranes using [3H]5'-(N-ethylcarboxamido)-adenosine (NECA) as the ligand
In DepthDetails ArticlePubMed