BDBM50019163 Acetyl-Beta-Boswellic Acid::CHEMBL236906
SMILES [H][C@@]12CC[C@]3(C)[C@]([H])(CC=C4[C@]5([H])[C@@H](C)[C@H](C)CC[C@]5(C)CC[C@@]34C)[C@@]1(C)CC[C@@H](OC(C)=O)[C@]2(C)C(O)=O
InChI Key InChIKey=YJBVHJIKNLBFDX-MQURJEHKSA-N
Data  9 IC50
  Tab Delimited (TSV)   2D SDfile   Computed 3D by Vconf -m prep SDfile
Find this compound or compounds like it in BindingDB:
Activity Spreadsheet -- Enzyme Inhibition Constant Data from BindingDB
Found 9 hits for monomerid = 50019163
TargetProstaglandin E synthase(Homo sapiens (Human))
University Of Tuebingen
Curated by ChEMBL
LigandPNGBDBM50019163(Acetyl-Beta-Boswellic Acid | CHEMBL236906)
Affinity DataIC50:  3.00E+3nM. Assay description: Inhibition of microsomal PGES1 isolated from IL-1beta-stimulated human A549 cells preincubated for 15 mins followed by substrate addition measured af...
In DepthDetails ArticlePubMed
TargetPolyunsaturated fatty acid 5-lipoxygenase(Homo sapiens (Human))
Osaka University
Curated by ChEMBL
LigandPNGBDBM50019163(Acetyl-Beta-Boswellic Acid | CHEMBL236906)
Affinity DataIC50: >4.00E+4nM. Assay description: Inhibition of human recombinant 5-LOX expressed in insect cells assessed as decrease in production of 5-HPETE and 5-HETE using arachidonic acid as su...
In DepthDetails ArticlePubMed
TargetPolyunsaturated fatty acid lipoxygenase ALOX15B(Homo sapiens (Human))
Osaka University
Curated by ChEMBL
LigandPNGBDBM50019163(Acetyl-Beta-Boswellic Acid | CHEMBL236906)
Affinity DataIC50:  1.22E+4nM. Assay description: Inhibition of human recombinant N-terminal His-tagged 15-LOX2 expressed in Escherichia coli using arachidonic acid as substrate preincubated for 5 mi...
In DepthDetails ArticlePubMed
TargetProstaglandin G/H synthase 1(Ovis aries (Sheep))
Osaka University
Curated by ChEMBL
LigandPNGBDBM50019163(Acetyl-Beta-Boswellic Acid | CHEMBL236906)
Affinity DataIC50: >4.00E+4nM. Assay description: Inhibition of ovine recombinant COX1 assessed as decrease in formation of PGE2 using arachidonic acid as substrate preincubated for 10 mins followed ...
In DepthDetails ArticlePubMed
TargetPolyunsaturated fatty acid lipoxygenase ALOX15B(Homo sapiens (Human))
Osaka University
Curated by ChEMBL
LigandPNGBDBM50019163(Acetyl-Beta-Boswellic Acid | CHEMBL236906)
Affinity DataIC50:  1.22E+4nM. Assay description: Inhibition of human recombinant N-terminal His-tagged 15-LOX2 expressed in Escherichia coli using arachidonic acid as substrate preincubated for 5 mi...
In DepthDetails ArticlePubMed
TargetProstaglandin G/H synthase 1(Ovis aries (Sheep))
Osaka University
Curated by ChEMBL
LigandPNGBDBM50019163(Acetyl-Beta-Boswellic Acid | CHEMBL236906)
Affinity DataIC50: >4.00E+4nM. Assay description: Inhibition of ovine recombinant COX1 assessed as decrease in formation of PGE2 using arachidonic acid as substrate preincubated for 10 mins followed ...
In DepthDetails ArticlePubMed
TargetPolyunsaturated fatty acid 5-lipoxygenase(Homo sapiens (Human))
Osaka University
Curated by ChEMBL
LigandPNGBDBM50019163(Acetyl-Beta-Boswellic Acid | CHEMBL236906)
Affinity DataIC50: >4.00E+4nM. Assay description: Inhibition of human recombinant 5-LOX expressed in insect cells assessed as decrease in production of 5-HPETE and 5-HETE using arachidonic acid as su...
In DepthDetails ArticlePubMed
TargetProstaglandin G/H synthase 2(Homo sapiens (Human))
Osaka University
Curated by ChEMBL
LigandPNGBDBM50019163(Acetyl-Beta-Boswellic Acid | CHEMBL236906)
Affinity DataIC50: >4.00E+4nM. Assay description: Inhibition of human recombinant COX2 expressed in baculovirus infected sf21 cells assessed as decrease in PGE2 formation using arachidonic acid as su...
In DepthDetails ArticlePubMed
TargetProstaglandin G/H synthase 2(Homo sapiens (Human))
Osaka University
Curated by ChEMBL
LigandPNGBDBM50019163(Acetyl-Beta-Boswellic Acid | CHEMBL236906)
Affinity DataIC50: >4.00E+4nM. Assay description: Inhibition of human recombinant COX2 expressed in baculovirus infected sf21 cells assessed as decrease in PGE2 formation using arachidonic acid as su...
In DepthDetails ArticlePubMed