BDBM50019472 CHEMBL3290729
SMILES CCOC(=O)CNC(=O)Cc1coc2cc(Cl)c(cc12)C(=O)Oc1ccncc1C(=O)N1CCN(C2CC2)c2ccccc12
InChI Key InChIKey=ZTZXQRSNEBZXKU-UHFFFAOYSA-N
Data  1 EC50
  Tab Delimited (TSV)   2D SDfile   Computed 3D by Vconf -m prep SDfile
Find this compound or compounds like it in BindingDB:
Activity Spreadsheet -- Enzyme Inhibition Constant Data from BindingDB
Found 1 hit for monomerid = 50019472
TargetG-protein coupled bile acid receptor 1(Homo sapiens (Human))
Chinese Academy Of Sciences
Curated by ChEMBL
LigandPNGBDBM50019472(CHEMBL3290729)
Affinity DataEC50:  520nM. Assay description: Agonist activity at human TGR5 expressed in HEK293 cells co-expressing CRE after 5.5 hrs by luciferase reporter gene assay
In DepthDetails ArticlePubMed