BDBM50019493 CHEMBL3290731
SMILES CCOC(=O)\C=C\c1oc2ccc(Cl)c(Oc3ccncc3C(=O)N3CCN(C4CC4)c4ccccc34)c2c1C
InChI Key InChIKey=PTIUNFXQKYZPGH-OUKQBFOZSA-N
Data  2 EC50
  Tab Delimited (TSV)   2D SDfile   Computed 3D by Vconf -m prep SDfile
Find this compound or compounds like it in BindingDB:
Activity Spreadsheet -- Enzyme Inhibition Constant Data from BindingDB
Found 2 hits for monomerid = 50019493
TargetG-protein coupled bile acid receptor 1(Mus musculus)
Chinese Academy Of Sciences
Curated by ChEMBL
LigandPNGBDBM50019493(CHEMBL3290731)
Affinity DataEC50:  16nM. Assay description: Agonist activity at mouse TGR5 expressed in HEK293 cells co-expressing CRE after 5.5 hrs by luciferase reporter gene assay
In DepthDetails ArticlePubMed
TargetG-protein coupled bile acid receptor 1(Homo sapiens (Human))
Chinese Academy Of Sciences
Curated by ChEMBL
LigandPNGBDBM50019493(CHEMBL3290731)
Affinity DataEC50:  8.90nM. Assay description: Agonist activity at human TGR5 expressed in HEK293 cells co-expressing CRE after 5.5 hrs by luciferase reporter gene assay
In DepthDetails ArticlePubMed