BDBM50020124 4-{4-[4-(6-chloro-2-pyrazinyl)hexahydro-1-pyrazinyl]butyl}-4-azatetracyclo[5.3.2.02,6.08,10]dodec-11-ene-3,5-dione;Hydrochloride::CHEMBL29155
SMILES Clc1cncc(n1)N1CCN(CCCCN2C(=O)C3C(C4C=CC3C3CC43)C2=O)CC1
InChI Key InChIKey=UYKWDOHZJVLLMU-UHFFFAOYSA-N
Data  2 KI
  Tab Delimited (TSV)   2D SDfile   Computed 3D by Vconf -m prep SDfile
Find this compound or compounds like it in BindingDB:
Activity Spreadsheet -- Enzyme Inhibition Constant Data from BindingDB
Found 2 hits for monomerid = 50020124
Target5-hydroxytryptamine receptor 1A(Rattus norvegicus (rat))
Wyeth-Ayerst Research
Curated by ChEMBL
LigandPNGBDBM50020124(4-{4-[4-(6-chloro-2-pyrazinyl)hexahydro-1-pyraziny...)
Affinity DataKi:  162nM. Assay description: In vitro inhibition of [3H]spiperone binding to 5-hydroxytryptamine 1A receptor from rat hippocampal tissue.
In DepthDetails ArticlePubMed
TargetD(2) dopamine receptor(Rattus norvegicus (rat))
Wyeth-Ayerst Research
Curated by ChEMBL
LigandPNGBDBM50020124(4-{4-[4-(6-chloro-2-pyrazinyl)hexahydro-1-pyraziny...)
Affinity DataKi:  690nM. Assay description: In vitro inhibition of [3H]spiperone binding to Dopamine receptor D2 from rat brain limbic tissue
In DepthDetails ArticlePubMed