BDBM50020464 CHEMBL135161::[5-(2-Methoxycarbonylamino-1H-benzoimidazole-5-carbonyl)-thiophen-3-yl]-acetic acid ethyl ester
SMILES CCOC(=O)Cc1csc(c1)C(=O)c1ccc2nc(NC(=O)OC)[nH]c2c1
InChI Key InChIKey=LYASIVXFWCFXMP-UHFFFAOYSA-N
Data  1 IC50
  Tab Delimited (TSV)   2D SDfile   Computed 3D by Vconf -m prep SDfile
Find this compound or compounds like it in BindingDB:
Activity Spreadsheet -- Enzyme Inhibition Constant Data from BindingDB
Found 1 hit for monomerid = 50020464
TargetTubulin alpha-1A chain(Sus scrofa (Pig))
Smith Kline & French Laboratories
Curated by ChEMBL
LigandPNGBDBM50020464(CHEMBL135161 | [5-(2-Methoxycarbonylamino-1H-benzo...)
Affinity DataIC50:  880nM. Assay description: Displacement of 5.8 uM [3H]-oncodazole from homogeneous tubulin.
In DepthDetails ArticlePubMed