BDBM50020645 2,4b-Dimethyl-7-oxo-1,2,3,4,4a,4b,7,9,10,10a-decahydro-phenanthrene-2-carbaldehyde::CHEMBL158600
SMILES CC1(CCC2C(CCC3=CC(=O)C=CC23C)C1)C=O
InChI Key InChIKey=XFDLZKMDVPATED-UHFFFAOYSA-N
Data  1 KI
  Tab Delimited (TSV)   2D SDfile   Computed 3D by Vconf -m prep SDfile
Find this compound or compounds like it in BindingDB:
Activity Spreadsheet -- Enzyme Inhibition Constant Data from BindingDB
Found 1 hit for monomerid = 50020645
TargetAromatase(Homo sapiens (Human))
Washington University
Curated by ChEMBL
LigandPNGBDBM50020645(2,4b-Dimethyl-7-oxo-1,2,3,4,4a,4b,7,9,10,10a-decah...)
Affinity DataKi:  3.98E+3nM. Assay description: Inactivation rate (Ki) of human placental Cytochrome P450 19A1
In DepthDetails ArticlePubMed